﻿パス,詳細図平面図,詳細図正面図,詳細図右側面図,詳細図左側面図,意匠図平面図,意匠図正面図,意匠図右側面図,意匠図左側面図,第1分類,第2分類,第3分類,第4分類,品名,品番,注記,仕様1,仕様2,仕様3,仕様4,仕様5
/SENMEN/COUNTER/,MB450HDS(1600)_A,MB450HDS(1600)_B,MB450HDS(1600)_C,MB450HDS(1600)_D,,,,,洗面化粧室,パブリック,カウンタータイプ,,マーベリイナカウンター/シェルフ一体タイプ,MB-450HDS(1600),,洗面タイプ,,奥行き=450,フロント照明付鏡,
/SENMEN/COUNTER/,MB450HTS(1600)_A,MB450HTS(1600)_B,MB450HTS(1600)_C,MB450HTS(1600)_D,,,,,洗面化粧室,パブリック,カウンタータイプ,,マーベリイナカウンター/シェルフ一体タイプ,MB-450HTS(1600),,洗面タイプ,,奥行き=450,フロント照明付鏡,
/SENMEN/COUNTER/,MB550HDS(1600)_A,MB550HDS(1600)_B,MB550HDS(1600)_C,MB550HDS(1600)_D,,,,,洗面化粧室,パブリック,カウンタータイプ,,マーベリイナカウンター/シェルフ一体タイプ,MB-550HDS(1600),,洗面タイプ,,奥行き=550,フロント照明付鏡,
/SENMEN/COUNTER/,MB550HTS(1600)_A,MB550HTS(1600)_B,MB550HTS(1600)_C,MB550HTS(1600)_D,,,,,洗面化粧室,パブリック,カウンタータイプ,,マーベリイナカウンター/シェルフ一体タイプ,MB-550HTS(1600),,洗面タイプ,,奥行き=550,フロント照明付鏡,
/SENMEN/COUNTER/,MB350M_A,MB350M_B,MB350M_C,MB350M_D,,,,,洗面化粧室,パブリック,カウンタータイプ,,マーベリイナカウンター/スタンダードMタイプ,MB-350M,,洗面タイプ,,奥行き=350,オーバーカウンター,
/SENMEN/COUNTER/,MB600S_A,MB600S_B,MB600S_C,MB600S_D,,,,,洗面化粧室,パブリック,カウンタータイプ,,マーベリイナカウンター/スタンダードMタイプ,MB-600S,,洗面タイプ,,奥行き=585,アンダーカウンター,
/SENMEN/COUNTER/,MB600SS_A,MB600SS_B,MB600SS_C,MB600SS_D,,,,,洗面化粧室,パブリック,カウンタータイプ,,マーベリイナカウンター/スタンダードMタイプ,MB-600SS(2100),,洗面タイプ,,奥行き=585,,
/SENMEN/COUNTER/,MB601NS_A,MB601NS_B,MB601NS_C,MB601NS_D,,,,,洗面化粧室,パブリック,カウンタータイプ,,マーベリイナカウンター/スタンダードMタイプ,MB-601NS(1500),,洗面タイプ,,奥行き=606,,
/SENMEN/COUNTER/,MB451KT5WS_A,MB451KT5WS_B,MB451KT5WS_C,MB451KT5WS_D,,,,,洗面化粧室,パブリック,カウンタータイプ,,マーベリイナカウンター/ボウル一体タイプ,MB-451KT5WS(1600),,洗面タイプ,,奥行き=450,,
/SENMEN/COUNTER/,MB501KT5WS_A,MB501KT5WS_B,MB501KT5WS_C,MB501KT5WS_D,,,,,洗面化粧室,パブリック,カウンタータイプ,,マーベリイナカウンター/ボウル一体タイプ,MB-501KT5WS(1800),,洗面タイプ,,奥行き=500,,
/SENMEN/DRIER/,KS590BH_SA,KS590BH_SB,KS590BH_SC,KS590BH_SD,,,,,洗面化粧室,パブリック,ハンドドライヤー,,ハンドドライヤー 壁掛け衛生強化タイプ,KS-590BH,,,,,,
/SENMEN/DRIER/,KS580AH_SA,KS580AH_SB,KS580AH_SC,KS580AH_SD,,,,,洗面化粧室,パブリック,ハンドドライヤー,,ハンドドライヤー 壁掛コンパクトタイプ ヒーターあり,KS-580AH,,,,,,
/SENMEN/DRIER/,KS580A_SA,KS580A_SB,KS580A_SC,KS580A_SD,,,,,洗面化粧室,パブリック,ハンドドライヤー,,ハンドドライヤー 壁掛コンパクトタイプ ヒーターなし,KS-580A,,,,,,
/SENMEN/DRIER/,KS570AH_SA,KS570AH_SB,KS570AH_SC,KS570AH_SD,,,,,洗面化粧室,パブリック,ハンドドライヤー,,ハンドドライヤー(ヒーターあり),KS-570AH,,,,,,
/SENMEN/DRIER/,KS570BH_SA,KS570BH_SB,KS570BH_SC,KS570BH_SD,,,,,洗面化粧室,パブリック,ハンドドライヤー,,ハンドドライヤー(ヒーターあり),KS-570BH,,,,,,
/SENMEN/DOCARE_S/,LFWF340SYC_MB_2_A,LFWF340SYC_MB_2_B,LFWF340SYC_MB_2_C,LFWF340SYC_MB_2_D,,,,,洗面化粧室,パブリック,施設向け商品,,ドゥケアカウンター（自立歩行者向け）コンポタイプ,LF-WF340SYC-MB,,水栓金具,,,,
/SENMEN/DOCARE_S/,MDCX751X_A,MDCX751X_B,MDCX751X_C,MDCX751X_D,,,,,洗面化粧室,パブリック,施設向け商品,,ドゥケアカウンター（自立歩行者向け）コンポタイプ,MDCX-751X,,ミラーキャビネット,間口＝750,,,
/SENMEN/DOCARE_C/,MFTX1751XPJGD_A,MFTX1751XPJGD_B,MFTX1751XPJGD_C,MFTX1751XPJGD_D,,,,,洗面化粧室,パブリック,施設向け商品,,ドゥケアカウンター（自立歩行者向け）コンポタイプ,MFTX1-751XPJ-G-D,,ミラーキャビネット,間口＝750,,,
/SENMEN/DOCARE_S/,MFTX751XPJUD_A,MFTX751XPJUD_B,MFTX751XPJUD_C,MFTX751XPJUD_D,,,,,洗面化粧室,パブリック,施設向け商品,,ドゥケアカウンター（自立歩行者向け）コンポタイプ,MFTX1-751XPJU-D,,ミラーキャビネット,間口＝750,,,
/SENMEN/DOCARE_S/,VSO755J1P_A,VSO755J1P_B,VSO755J1P_C,VSO755J1P_D,,,,,洗面化粧室,パブリック,施設向け商品,,ドゥケアカウンター（自立歩行者向け）コンポタイプ,VSO-755J1(P),,化粧台本体,間口＝750,,,
/SENMEN/DOCARE_S/,VSO755J1P_751XPJUD_A,VSO755J1P_751XPJUD_B,VSO755J1P_751XPJUD_C,VSO755J1P_751XPJUD_D,,,,,洗面化粧室,パブリック,施設向け商品,,ドゥケアカウンター（自立歩行者向け）コンポタイプ,VSO-755J1(P)･MFTX1-751XPJU-D,,洗面化粧台,間口＝750,,,
/SENMEN/DOCARE_C/,VSO75W5YEE1P_A,VSO75W5YEE1P_B,VSO75W5YEE1P_C,VSO75W5YEE1P_D,,,,,洗面化粧室,パブリック,施設向け商品,,ドゥケアカウンター（自立歩行者向け）コンポタイプ,VSO-75W5YEE1(P),,化粧台本体,間口＝750,,,
/SENMEN/DOCARE_C/,VSO75W5YEE1S_A,VSO75W5YEE1S_B,VSO75W5YEE1S_C,VSO75W5YEE1S_D,,,,,洗面化粧室,パブリック,施設向け商品,,ドゥケアカウンター（自立歩行者向け）コンポタイプ,VSO-75W5YEE1(S),,化粧台本体,間口＝750,,,
/SENMEN/DOCARE_C/,DCXO755SYP_A,DCXO755SYP_B,DCXO755SYP_C,DCXO755SYP_D,,,,,洗面化粧室,パブリック,施設向け商品,,ドゥケアカウンター（車椅子対応）ストレート・コンポタイプ,DCXO-755SY(P),,化粧台本体,間口＝750,,,
/SENMEN/DOCARE_S/,DCXO755SY_751X_A,DCXO755SY_751X_B,DCXO755SY_751X_C,DCXO755SY_751X_D,,,,,洗面化粧室,パブリック,施設向け商品,,ドゥケアカウンター（車椅子対応）ストレート・コンポタイプ,DCXO-755SY(P)･MDCX-751X,,洗面化粧台,間口＝750,,,
/SENMEN/DOCARE_C/,DCXO755SYS_A,DCXO755SYS_B,DCXO755SYS_C,DCXO755SYS_D,,,,,洗面化粧室,パブリック,施設向け商品,,ドゥケアカウンター（車椅子対応）ストレート・コンポタイプ,DCXO-755SY(S),,化粧台本体,間口＝750,,,
/SENMEN/DOCARE_S/,DCXO905SY_A,DCXO905SY_B,DCXO905SY_C,DCXO905SY_D,,,,,洗面化粧室,パブリック,施設向け商品,,ドゥケアカウンター（車椅子対応）ストレート・コンポタイプ,DCXO-905SY(P),,化粧台本体,間口＝900,,,
/SENMEN/DOCARE_S/,DCXO905SY_901X_A,DCXO905SY_901X_B,DCXO905SY_901X_C,DCXO905SY_901X_D,,,,,洗面化粧室,パブリック,施設向け商品,,ドゥケアカウンター（車椅子対応）ストレート・コンポタイプ,DCXO-905SY(P)･MDCX-901X,,洗面化粧台,間口＝900,,,
/SENMEN/DOCARE_S/,DCXO905SY_903X_A,DCXO905SY_903X_B,DCXO905SY_903X_C,DCXO905SY_903X_D,,,,,洗面化粧室,パブリック,施設向け商品,,ドゥケアカウンター（車椅子対応）ストレート・コンポタイプ,DCXO-905SY(P)･MDCX-903TX･DCXS-304,,洗面化粧台,間口＝900,,,
/SENMEN/DOCARE_C/,DCXO905SYS_A,DCXO905SYS_B,DCXO905SYS_C,DCXO905SYS_D,,,,,洗面化粧室,パブリック,施設向け商品,,ドゥケアカウンター（車椅子対応）ストレート・コンポタイプ,DCXO-905SY(S),,化粧台本体,間口＝900,,,
/SENMEN/DOCARE_S/,DCXO905SYR_A,DCXO905SYR_B,DCXO905SYR_C,DCXO905SYR_D,,,,,洗面化粧室,パブリック,施設向け商品,,ドゥケアカウンター（車椅子対応）ストレート・コンポタイプ,DCXO-905SYR(P),,化粧台本体,間口＝900,,,
/SENMEN/DOCARE_S/,DCXO905SYT2_A,DCXO905SYT2_B,DCXO905SYT2_C,DCXO905SYT2_D,,,,,洗面化粧室,パブリック,施設向け商品,,ドゥケアカウンター（車椅子対応）ストレート・コンポタイプ,DCXO-905SYT2(P),,化粧台本体,間口＝900,,,
/SENMEN/DOCARE_S/,DCXO907J2_A,DCXO907J2_B,DCXO907J2_C,DCXO907J2_D,,,,,洗面化粧室,パブリック,施設向け商品,,ドゥケアカウンター（車椅子対応）ストレート・コンポタイプ,DCXO-907J2(P),,化粧台本体,間口＝900,,,
/SENMEN/DOCARE_S/,DCXO907J2T2_A,DCXO907J2T2_B,DCXO907J2T2_C,DCXO907J2T2_D,,,,,洗面化粧室,パブリック,施設向け商品,,ドゥケアカウンター（車椅子対応）ストレート・コンポタイプ,DCXO-907J2T2(P),,化粧台本体,間口＝900,,,
/SENMEN/DOCARE_C/,MDCX753TX_A,MDCX753TX_B,MDCX753TX_C,MDCX753TX_D,,,,,洗面化粧室,パブリック,施設向け商品,,ドゥケアカウンター（車椅子対応）ストレート・コンポタイプ,MDCX-753TX,,ミラーキャビネット,間口＝750,,,
/SENMEN/DOCARE_S/,MDCX901X_A,MDCX901X_B,MDCX901X_C,MDCX901X_D,,,,,洗面化粧室,パブリック,施設向け商品,,ドゥケアカウンター（車椅子対応）ストレート・コンポタイプ,MDCX-901X,,ミラーキャビネット,間口＝900,,,
/SENMEN/DOCARE_S/,MDCX903TX_A,MDCX903TX_B,MDCX903TX_C,MDCX903TX_D,,,,,洗面化粧室,パブリック,施設向け商品,,ドゥケアカウンター（車椅子対応）ストレート・コンポタイプ,MDCX-903TX,,ミラーキャビネット,間口＝900,,,
/SENMEN/DOCARE_C/,MGR1751XJUGD_A,MGR1751XJUGD_B,MGR1751XJUGD_C,MGR1751XJUGD_D,,,,,洗面化粧室,パブリック,施設向け商品,,ドゥケアカウンター（車椅子対応）ストレート・コンポタイプ,MGR1-751XJU-G-D,,ミラーキャビネット,間口＝750,,,
/SENMEN/DOCARE_S/,MGR901XJUD_A,MGR901XJUD_B,MGR901XJUD_C,MGR901XJUD_D,,,,,洗面化粧室,パブリック,施設向け商品,,ドゥケアカウンター（車椅子対応）ストレート・コンポタイプ,MGR1-901XJU-D,,ミラーキャビネット,間口＝900,,,
/SENMEN/DOCARE_C/,MGR1901XJUGD_A,MGR1901XJUGD_B,MGR1901XJUGD_C,MGR1901XJUGD_D,,,,,洗面化粧室,パブリック,施設向け商品,,ドゥケアカウンター（車椅子対応）ストレート・コンポタイプ,MGR1-901XJU-G-D,,ミラーキャビネット,間口＝900,,,
/SENMEN/DOCARE_C/,AM300TCV1_A,AM300TCV1_B,AM300TCV1_C,AM300TCV1_D,,,,,洗面化粧室,パブリック,施設向け商品,,ドゥケアカウンター（車椅子対応）ストレート・フリータイプ,AM-300TCV1,,,,,,
/SENMEN/DOCARE_C/,AM311TCV1_A,AM311TCV1_B,AM311TCV1_C,AM311TCV1_D,,,,,洗面化粧室,パブリック,施設向け商品,,ドゥケアカウンター（車椅子対応）ストレート・フリータイプ,AM-311TCV1,,,,,,
/SENMEN/DOCARE_C/,BBDCX2_A,BBDCX2_B,BBDCX2_C,BBDCX2_D,,,,,洗面化粧室,パブリック,施設向け商品,,ドゥケアカウンター（車椅子対応）ストレート・フリータイプ,BB-DCX2J,,手すり,間口＝900・1000・1200兼用,,,
/SENMEN/DOCARE_C/,DM601NAL_900_A,DM601NAL_900_B,DM601NAL_900_C,DM601NAL_900_D,,,,,洗面化粧室,パブリック,施設向け商品,,ドゥケアカウンター（車椅子対応）ストレート・フリータイプ,DM-601NAL(900)･AM-311TCV1･LF-DC7GBP･MBF-620A(*2)･BB-DM-60･BB-DCX2･MDCX-901X,,,,,,
/SENMEN/DOCARE_C/,DM601ND7S_1750_A,DM601ND7S_1750_B,DM601ND7S_1750_C,DM601ND7S_1750_D,,,,,洗面化粧室,パブリック,施設向け商品,,ドゥケアカウンター（車椅子対応）ストレート・フリータイプ,DM-601ND7S(1750)･AM-300TCV1(*2)･LF-DC7GBP(*2)･MBF-620A(*3)･BB-DM-60(*2)･BB-DCX2,,,,,,
/SENMEN/DOCARE_C/,DM601ND9S_1900_A,DM601ND9S_1900_B,DM601ND9S_1900_C,DM601ND9S_1900_D,,,,,洗面化粧室,パブリック,施設向け商品,,ドゥケアカウンター（車椅子対応）ストレート・フリータイプ,DM-601ND9S(1900)･AM-300TCV1(*2)･LF-DC7GBP(*2)･MBF-620A(*3)･BB-DM-60(*2)･BB-DCX2,,,,,,
/SENMEN/DOCARE_C/,DM601NT7S_2500_A,DM601NT7S_2500_B,DM601NT7S_2500_C,DM601NT7S_2500_D,,,,,洗面化粧室,パブリック,施設向け商品,,ドゥケアカウンター（車椅子対応）ストレート・フリータイプ,DM-601NT7S(2500)･AM-300TCV1(*3)･LF-DC7GBP(*3)･MBF-620A(*4)･BB-DM-60(*3)･BB-DCX2,,,,,,
/SENMEN/DOCARE_C/,SF500SYMB2DM_A,SF500SYMB2DM_B,SF500SYMB2DM_C,SF500SYMB2DM_D,,,,,洗面化粧室,パブリック,施設向け商品,,ドゥケアカウンター（車椅子対応）ストレート・フリータイプ,SF-500SY-MB2-DM,,,,,,
/SENMEN/DOCARE_C/,MDCX1001X_A,MDCX1001X_B,MDCX1001X_C,MDCX1001X_D,,,,,洗面化粧室,パブリック,施設向け商品,,ドゥケアカウンター（車椅子対応）ラウンド・コンポタイプ,MDCX-1001X,,ミラーキャビネット,間口＝1000,,,
/SENMEN/DOCARE_C/,MDCX1003TX_A,MDCX1003TX_B,MDCX1003TX_C,MDCX1003TX_D,,,,,洗面化粧室,パブリック,施設向け商品,,ドゥケアカウンター（車椅子対応）ラウンド・コンポタイプ,MDCX-1003TX,,ミラーキャビネット,間口＝1000,,,
/SENMEN/DOCARE_C/,MDCX1201X_A,MDCX1201X_B,MDCX1201X_C,MDCX1201X_D,,,,,洗面化粧室,パブリック,施設向け商品,,ドゥケアカウンター（車椅子対応）ラウンド・コンポタイプ,MDCX-1201X,,ミラーキャビネット,間口＝1200,,,
/SENMEN/DOCARE_C/,MDCX1203TX_A,MDCX1203TX_B,MDCX1203TX_C,MDCX1203TX_D,,,,,洗面化粧室,パブリック,施設向け商品,,ドゥケアカウンター（車椅子対応）ラウンド・コンポタイプ,MDCX-1203TX,,ミラーキャビネット,間口＝1200,,,
/SENMEN/DOCARE_C/,MDCX753TX_A,MDCX753TX_B,MDCX753TX_C,MDCX753TX_D,,,,,洗面化粧室,パブリック,施設向け商品,,ドゥケアカウンター（車椅子対応）ラウンド・コンポタイプ,MDCX-753TX,,ミラーキャビネット,間口＝750,,,
/SENMEN/DOCARE_S/,MDCX901X_A,MDCX901X_B,MDCX901X_C,MDCX901X_D,,,,,洗面化粧室,パブリック,施設向け商品,,ドゥケアカウンター（車椅子対応）ラウンド・コンポタイプ,MDCX-901X,,ミラーキャビネット,間口＝900,,,
/SENMEN/DOCARE_S/,MDCX903TX_A,MDCX903TX_B,MDCX903TX_C,MDCX903TX_D,,,,,洗面化粧室,パブリック,施設向け商品,,ドゥケアカウンター（車椅子対応）ラウンド・コンポタイプ,MDCX-903TX,,ミラーキャビネット,間口＝900,,,
/SENMEN/DOCARE_C/,MGR11001XJUGD_A,MGR11001XJUGD_B,MGR11001XJUGD_C,MGR11001XJUGD_D,,,,,洗面化粧室,パブリック,施設向け商品,,ドゥケアカウンター（車椅子対応）ラウンド・コンポタイプ,MGR1-1001XJU-G-D,,ミラーキャビネット,間口＝1000,,,
/SENMEN/DOCARE_C/,MGR11201XJUGD_A,MGR11201XJUGD_B,MGR11201XJUGD_C,MGR11201XJUGD_D,,,,,洗面化粧室,パブリック,施設向け商品,,ドゥケアカウンター（車椅子対応）ラウンド・コンポタイプ,MGR1-1201XJU-G-D,,ミラーキャビネット,間口＝1200,,,
/SENMEN/DOCARE_C/,MGR1751XJUGD_A,MGR1751XJUGD_B,MGR1751XJUGD_C,MGR1751XJUGD_D,,,,,洗面化粧室,パブリック,施設向け商品,,ドゥケアカウンター（車椅子対応）ラウンド・コンポタイプ,MGR1-751XJU-G-D,,ミラーキャビネット,間口＝750,,,
/SENMEN/DOCARE_S/,MGR901XJUD_A,MGR901XJUD_B,MGR901XJUD_C,MGR901XJUD_D,,,,,洗面化粧室,パブリック,施設向け商品,,ドゥケアカウンター（車椅子対応）ラウンド・コンポタイプ,MGR1-901XJU-D,,ミラーキャビネット,間口＝900,,,
/SENMEN/DOCARE_C/,MGR1901XJUGD_A,MGR1901XJUGD_B,MGR1901XJUGD_C,MGR1901XJUGD_D,,,,,洗面化粧室,パブリック,施設向け商品,,ドゥケアカウンター（車椅子対応）ラウンド・コンポタイプ,MGR1-901XJU-G-D,,ミラーキャビネット,間口＝900,,,
/SENMEN/DOCARE_C/,VHO1005SYP_A,VHO1005SYP_B,VHO1005SYP_C,VHO1005SYP_D,,,,,洗面化粧室,パブリック,施設向け商品,,ドゥケアカウンター（車椅子対応）ラウンド・コンポタイプ,VHO-1005SY(P),,化粧台本体,間口＝1000,,,
/SENMEN/DOCARE_S/,VHO1005SYP_1001XJUD_A,VHO1005SYP_1001XJUD_B,VHO1005SYP_1001XJUD_C,VHO1005SYP_1001XJUD_D,,,,,洗面化粧室,パブリック,施設向け商品,,ドゥケアカウンター（車椅子対応）ラウンド・コンポタイプ,VHO-1005SY(P)･MGR1-1001XJU-D,,売れ筋セット,間口＝1000,,,
/SENMEN/DOCARE_C/,VHO1005SYS_A,VHO1005SYS_B,VHO1005SYS_C,VHO1005SYS_D,,,,,洗面化粧室,パブリック,施設向け商品,,ドゥケアカウンター（車椅子対応）ラウンド・コンポタイプ,VHO-1005SY(S),,化粧台本体,間口＝1000,,,
/SENMEN/DOCARE_C/,VHO1205SYP_A,VHO1205SYP_B,VHO1205SYP_C,VHO1205SYP_D,,,,,洗面化粧室,パブリック,施設向け商品,,ドゥケアカウンター（車椅子対応）ラウンド・コンポタイプ,VHO-1205SY(P),,化粧台本体,間口＝1200,,,
/SENMEN/DOCARE_S/,VHO1205SYP_1201XJUD_A,VHO1205SYP_1201XJUD_B,VHO1205SYP_1201XJUD_C,VHO1205SYP_1201XJUD_D,,,,,洗面化粧室,パブリック,施設向け商品,,ドゥケアカウンター（車椅子対応）ラウンド・コンポタイプ,VHO-1205SY(P)･MGR1-1201XJU-D,,売れ筋セット,間口＝1200,,,
/SENMEN/DOCARE_C/,VHO1205SYS_A,VHO1205SYS_B,VHO1205SYS_C,VHO1205SYS_D,,,,,洗面化粧室,パブリック,施設向け商品,,ドゥケアカウンター（車椅子対応）ラウンド・コンポタイプ,VHO-1205SY(S),,化粧台本体,間口＝1200,,,
/SENMEN/DOCARE_C/,VHO755SYP_A,VHO755SYP_B,VHO755SYP_C,VHO755SYP_D,,,,,洗面化粧室,パブリック,施設向け商品,,ドゥケアカウンター（車椅子対応）ラウンド・コンポタイプ,VHO-755SY(P),,化粧台本体,間口＝750,,,
/SENMEN/DOCARE_S/,VHO755SYP_751XJUD_A,VHO755SYP_751XJUD_B,VHO755SYP_751XJUD_C,VHO755SYP_751XJUD_D,,,,,洗面化粧室,パブリック,施設向け商品,,ドゥケアカウンター（車椅子対応）ラウンド・コンポタイプ,VHO-755SY(P)･MGR1-751XJU-D,,売れ筋セット,間口＝750,,,
/SENMEN/DOCARE_C/,VHO755SYS_A,VHO755SYS_B,VHO755SYS_C,VHO755SYS_D,,,,,洗面化粧室,パブリック,施設向け商品,,ドゥケアカウンター（車椅子対応）ラウンド・コンポタイプ,VHO-755SY(S),,化粧台本体,間口＝750,,,
/SENMEN/DOCARE_S/,VHO905SYP_A,VHO905SYP_B,VHO905SYP_C,VHO905SYP_D,,,,,洗面化粧室,パブリック,施設向け商品,,ドゥケアカウンター（車椅子対応）ラウンド・コンポタイプ,VHO-905SY(P),,化粧台本体,間口＝900,,,
/SENMEN/DOCARE_S/,VHO905SYP_903TX_A,VHO905SYP_903TX_B,VHO905SYP_903TX_C,VHO905SYP_903TX_D,,,,,洗面化粧室,パブリック,施設向け商品,,ドゥケアカウンター（車椅子対応）ラウンド・コンポタイプ,VHO-905SY(P)･MDCX-903TX/VHS-304,,おすすめセット,間口＝1200,,,
/SENMEN/DOCARE_S/,VHO905SYP_901XJUD_A,VHO905SYP_901XJUD_B,VHO905SYP_901XJUD_C,VHO905SYP_901XJUD_D,,,,,洗面化粧室,パブリック,施設向け商品,,ドゥケアカウンター（車椅子対応）ラウンド・コンポタイプ,VHO-905SY(P)･MGR1-901XJU-D,,売れ筋セット,間口＝900,,,
/SENMEN/DOCARE_C/,VHO905SYS_A,VHO905SYS_B,VHO905SYS_C,VHO905SYS_D,,,,,洗面化粧室,パブリック,施設向け商品,,ドゥケアカウンター（車椅子対応）ラウンド・コンポタイプ,VHO-905SY(S),,化粧台本体,間口＝900,,,
/SENMEN/DOCARE_S/,VHO905SYTP_A,VHO905SYTP_B,VHO905SYTP_C,VHO905SYTP_D,,,,,洗面化粧室,パブリック,施設向け商品,,ドゥケアカウンター（車椅子対応）ラウンド・コンポタイプ,VHO-905SYT(P),,化粧台本体,間口＝900,,,
/SENMEN/DOCARE_S/,VHO907J1P_A,VHO907J1P_B,VHO907J1P_C,VHO907J1P_D,,,,,洗面化粧室,パブリック,施設向け商品,,ドゥケアカウンター（車椅子対応）ラウンド・コンポタイプ,VHO-907J1(P),,化粧台本体,間口＝900,,,
/SENMEN/DOCARE_S/,VHO907J1TP_A,VHO907J1TP_B,VHO907J1TP_C,VHO907J1TP_D,,,,,洗面化粧室,パブリック,施設向け商品,,ドゥケアカウンター（車椅子対応）ラウンド・コンポタイプ,VHO-907J1T(P),,化粧台本体,間口＝900,,,
/SENMEN/DOKODEMO/,SMA300NR(1800)L2XS_LFSR20E02HA(BPB)XS_A,SMA300NR(1800)L2XS_LFSR20E02HA(BPB)XS_B,SMA300NR(1800)L2XS_LFSR20E02HA(BPB)XS_C,SMA300NR(1800)L2XS_LFSR20E02HA(BPB)XS_D,,,,,洗面化粧室,住宅,手洗カウンター,,どこでも手洗,SMA-300NR(1800)L2-XS･LF-SR20-E02HA(BPB)-XS,W=600まで現地でカット可能,木カウンター,間口＝1800,壁排水（ボトルトラップ）,壁給水,
/SENMEN/DOKODEMO/,SMA300NT(600)C2XS_LFSR20E02HA(BPB)XS_A,SMA300NT(600)C2XS_LFSR20E02HA(BPB)XS_B,SMA300NT(600)C2XS_LFSR20E02HA(BPB)XS_C,SMA300NT(600)C2XS_LFSR20E02HA(BPB)XS_D,,,,,洗面化粧室,住宅,手洗カウンター,,どこでも手洗,SMA-300NT(600)C2-XS･LF-SR20-E02HA(BPB)-XS,,木カウンター,間口＝600,壁排水（ボトルトラップ）,壁給水,
/SENMEN/DOKODEMO/,SMA300NT(750)C2XS_LFSR20E02HA(BPB)XS_A,SMA300NT(750)C2XS_LFSR20E02HA(BPB)XS_B,SMA300NT(750)C2XS_LFSR20E02HA(BPB)XS_C,SMA300NT(750)C2XS_LFSR20E02HA(BPB)XS_D,,,,,洗面化粧室,住宅,手洗カウンター,,どこでも手洗,SMA-300NT(750)C2-XS･LF-SR20-E02HA(BPB)-XS,,木カウンター,間口＝750,壁排水（ボトルトラップ）,壁給水,
/SENMEN/DOKODEMO/,SMB300NR(1812)L2XS_LFCS14E02HA(SA)XS_A,SMB300NR(1812)L2XS_LFCS14E02HA(SA)XS_B,SMB300NR(1812)L2XS_LFCS14E02HA(SA)XS_C,SMB300NR(1812)L2XS_LFCS14E02HA(SA)XS_D,,,,,洗面化粧室,住宅,手洗カウンター,,どこでも手洗,SMB-300NR(1812)L2-XS･LF-CS14-E02HA(SA)-XS,W=600まで現地でカット可能,タイルカウンター,間口＝1812,床排水（Sトラップ）,床給水,
/SENMEN/DOKODEMO/,SMB300NT(620)C2XS_LFCS14E02HA(SA)XS_A,SMB300NT(620)C2XS_LFCS14E02HA(SA)XS_B,SMB300NT(620)C2XS_LFCS14E02HA(SA)XS_C,SMB300NT(620)C2XS_LFCS14E02HA(SA)XS_D,,,,,洗面化粧室,住宅,手洗カウンター,,どこでも手洗,SMB-300NT(620)C2-XS･LF-CS14-E02HA(SA)-XS,,タイルカウンター,間口＝620,床排水（Sトラップ）,床給水,
/SENMEN/DOKODEMO/,SMB300NT(760)C2XS_LFCS14E02HA(SA)XS_A,SMB300NT(760)C2XS_LFCS14E02HA(SA)XS_B,SMB300NT(760)C2XS_LFCS14E02HA(SA)XS_C,SMB300NT(760)C2XS_LFCS14E02HA(SA)XS_D,,,,,洗面化粧室,住宅,手洗カウンター,,どこでも手洗,SMB-300NT(760)C2-XS･LF-CS14-E02HA(SA)-XS,,タイルカウンター,間口＝760,床排水（Sトラップ）,床給水,
/SENMEN/BL3/,LBFTE500P_501_BL_A,LBFTE500P_501_BL_B,LBFTE500P_501_BL_C,LBFTE500P_501_BL_D,,,,,洗面化粧室,住宅,洗面化粧台タイプ,,BL化粧台,LBFTE1-500P･MFK-501SA(BL),,洗面化粧台セット,間口＝500,,,
/SENMEN/BL3/,LBFTE500S_501_BL_A,LBFTE500S_501_BL_B,LBFTE500S_501_BL_C,LBFTE500S_501_BL_D,,,,,洗面化粧室,住宅,洗面化粧台タイプ,,BL化粧台,LBFTE1-500S･MFK-501SA(BL),,洗面化粧台セット,間口＝500,,,
/SENMEN/BL3/,LBFTE503P_501_BL_A,LBFTE503P_501_BL_B,LBFTE503P_501_BL_C,LBFTE503P_501_BL_D,,,,,洗面化粧室,住宅,洗面化粧台タイプ,,BL化粧台,LBFTE1-503P･MFK-501SA(BL),,洗面化粧台セット,間口＝500,,,
/SENMEN/BL3/,LBFTE503S_501_BL_A,LBFTE503S_501_BL_B,LBFTE503S_501_BL_C,LBFTE503S_501_BL_D,,,,,洗面化粧室,住宅,洗面化粧台タイプ,,BL化粧台,LBFTE1-503S･MFK-501SA(BL),,洗面化粧台セット,間口＝500,,,
/SENMEN/BL3/,LBFTE504P_501_BL_A,LBFTE504P_501_BL_B,LBFTE504P_501_BL_C,LBFTE504P_501_BL_D,,,,,洗面化粧室,住宅,洗面化粧台タイプ,,BL化粧台,LBFTE1-504P･MFK-501SA(BL),,洗面化粧台セット,間口＝500,,,
/SENMEN/BL3/,LBFTE504S_501_BL_A,LBFTE504S_501_BL_B,LBFTE504S_501_BL_C,LBFTE504S_501_BL_D,,,,,洗面化粧室,住宅,洗面化粧台タイプ,,BL化粧台,LBFTE1-504S･MFK-501SA(BL),,洗面化粧台セット,間口＝500,,,
/SENMEN/BL3/,LBFTV600P_601_BL_A,LBFTV600P_601_BL_B,LBFTV600P_601_BL_C,LBFTV600P_601_BL_D,,,,,洗面化粧室,住宅,洗面化粧台タイプ,,BL化粧台,LBFTV-600P･MFTX1-601XPJ(BL),,洗面化粧台セット,間口＝600,,,
/SENMEN/BL3/,LBFTV600S_601_BL_A,LBFTV600S_601_BL_B,LBFTV600S_601_BL_C,LBFTV600S_601_BL_D,,,,,洗面化粧室,住宅,洗面化粧台タイプ,,BL化粧台,LBFTV-600S･MFTX1-601XPJ(BL),,洗面化粧台セット,間口＝600,,,
/SENMEN/BL3/,LBFTV604P_601_BL_A,LBFTV604P_601_BL_B,LBFTV604P_601_BL_C,LBFTV604P_601_BL_D,,,,,洗面化粧室,住宅,洗面化粧台タイプ,,BL化粧台,LBFTV-604P･MFTX1-601XPJ(BL),,洗面化粧台セット,間口＝600,,,
/SENMEN/BL3/,LBFTV604S_601_BL_A,LBFTV604S_601_BL_B,LBFTV604S_601_BL_C,LBFTV604S_601_BL_D,,,,,洗面化粧室,住宅,洗面化粧台タイプ,,BL化粧台,LBFTV-604S･MFTX1-601XPJ(BL),,洗面化粧台セット,間口＝600,,,
/SENMEN/BL3/,LBFTV605SYP_601_BL_A,LBFTV605SYP_601_BL_B,LBFTV605SYP_601_BL_C,LBFTV605SYP_601_BL_D,,,,,洗面化粧室,住宅,洗面化粧台タイプ,,BL化粧台,LBFTV-605SY2P･MFTX1-601XPJ(BL),,洗面化粧台セット,間口＝600,,,
/SENMEN/BL3/,LBFTV605SYS_601_BL_A,LBFTV605SYS_601_BL_B,LBFTV605SYS_601_BL_C,LBFTV605SYS_601_BL_D,,,,,洗面化粧室,住宅,洗面化粧台タイプ,,BL化粧台,LBFTV-605SY2S･MFTX1-601XPJ(BL),,洗面化粧台セット,間口＝600,,,
/SENMEN/BL3/,LBFTV750P_751_BL_A,LBFTV750P_751_BL_B,LBFTV750P_751_BL_C,LBFTV750P_751_BL_D,,,,,洗面化粧室,住宅,洗面化粧台タイプ,,BL化粧台,LBFTV-750P･MFTX1-751XPJ(BL),,洗面化粧台セット,間口＝750,,,
/SENMEN/BL3/,LBFTV750S_751_BL_A,LBFTV750S_751_BL_B,LBFTV750S_751_BL_C,LBFTV750S_751_BL_D,,,,,洗面化粧室,住宅,洗面化粧台タイプ,,BL化粧台,LBFTV-750S･MFTX1-751XPJ(BL),,洗面化粧台セット,間口＝750,,,
/SENMEN/BL3/,LBFTV754P_751_BL_A,LBFTV754P_751_BL_B,LBFTV754P_751_BL_C,LBFTV754P_751_BL_D,,,,,洗面化粧室,住宅,洗面化粧台タイプ,,BL化粧台,LBFTV-754P･MFTX1-751XPJ(BL),,洗面化粧台セット,間口＝750,,,
/SENMEN/BL3/,LBFTV754S_751_BL_A,LBFTV754S_751_BL_B,LBFTV754S_751_BL_C,LBFTV754S_751_BL_D,,,,,洗面化粧室,住宅,洗面化粧台タイプ,,BL化粧台,LBFTV-754S･MFTX1-751XPJ(BL),,洗面化粧台セット,間口＝750,,,
/SENMEN/BL3/,LBFTV755SYP_751_BL_A,LBFTV755SYP_751_BL_B,LBFTV755SYP_751_BL_C,LBFTV755SYP_751_BL_D,,,,,洗面化粧室,住宅,洗面化粧台タイプ,,BL化粧台,LBFTV-755SY2P･MFTX1-751XPJ(BL),,洗面化粧台セット,間口＝750,,,
/SENMEN/BL3/,LBFTV755SYS_751_BL_A,LBFTV755SYS_751_BL_B,LBFTV755SYS_751_BL_C,LBFTV755SYS_751_BL_D,,,,,洗面化粧室,住宅,洗面化粧台タイプ,,BL化粧台,LBFTV-755SY2S･MFTX1-751XPJ(BL),,洗面化粧台セット,間口＝750,,,
/SENMEN/BL3/,MFTV1_753TXP_BL_A,MFTV1_753TXP_BL_B,MFTV1_753TXP_BL_C,MFTV1_753TXP_BL_D,,,,,洗面化粧室,住宅,洗面化粧台タイプ,,BL化粧台,MFTV1-753TXJ(BL),,ミラーキャビネット,間口＝750,,,
/SENMEN/BL3/,MFTX601XFJ_BL_A,MFTX601XFJ_BL_B,MFTX601XFJ_BL_C,MFTX601XFJ_BL_D,,,,,洗面化粧室,住宅,洗面化粧台タイプ,,BL化粧台,MFTX1-601XFJ(BL),,ミラーキャビネット,間口＝600,,,
/SENMEN/BL3/,MFTX751XFJ_BL_A,MFTX751XFJ_BL_B,MFTX751XFJ_BL_C,MFTX751XFJ_BL_D,,,,,洗面化粧室,住宅,洗面化粧台タイプ,,BL化粧台,MFTX1-751XFJ(BL),,ミラーキャビネット,間口＝750,,,
/SENMEN/ESTBES/,LFG555E345SYC_1200L_A,LFG555E345SYC_1200L_B,LFG555E345SYC_1200L_C,LFG555E345SYC_1200L_D,,,,,洗面化粧室,住宅,洗面化粧台タイプ,,エスタ/ベッセルタイプ,LF-Y555-E345SYC(PS)MB･NSY-450NT(1200)L5AB･NTYN-604A･BB-NSY-T(560)･NSYE-040A･MNS-601K･NSK-301C･NSK-301C,,おすすめセット,間口＝1200,,,
/SENMEN/ESTBES/,LFG555E345SYC_1350L_A,LFG555E345SYC_1350L_B,LFG555E345SYC_1350L_C,LFG555E345SYC_1350L_D,,,,,洗面化粧室,住宅,洗面化粧台タイプ,,エスタ/ベッセルタイプ,LF-Y555-E345SYC(PS)MB･NSY-450NT(1350)L5AB･NTYN-754A･BB-NSY-T(560)･NSYE-040A･MNS-551K･NSKO-201･NSK-301C･NSK-301C,,おすすめセット,間口＝1350,,,
/SENMEN/ESTBES/,MNS451N_A,MNS451N_B,MNS451N_C,MNS451N_D,,,,,洗面化粧室,住宅,洗面化粧台タイプ,,エスタ/ベッセルタイプ,MNS-451N,,ミラーキャビネット,間口＝450,,,
/SENMEN/ESTBES/,MNS551K_NSK201C_A,MNS551K_NSK201C_B,MNS551K_NSK201C_C,MNS551K_NSK201C_D,,,,,洗面化粧室,住宅,洗面化粧台タイプ,,エスタ/ベッセルタイプ,MNS-551K･NSK-201C,,ミラーキャビネット,間口＝750,,,
/SENMEN/ESTBES/,MNS551K_NSKO201_A,MNS551K_NSKO201_B,MNS551K_NSKO201_C,MNS551K_NSKO201_D,,,,,洗面化粧室,住宅,洗面化粧台タイプ,,エスタ/ベッセルタイプ,MNS-551K･NSKO-201,,ミラーキャビネット,間口＝750,,,
/SENMEN/ESTBES/,MNS751K_A,MNS751K_B,MNS751K_C,MNS751K_D,,,,,洗面化粧室,住宅,洗面化粧台タイプ,,エスタ/ベッセルタイプ,MNS-751K,,ミラーキャビネット,間口＝750,,,
/SENMEN/ESTBES/,NTAN60E5HY_451K_A,NTAN60E5HY_451K_B,NTAN60E5HY_451K_C,NTAN60E5HY_451K_D,,,,,洗面化粧室,住宅,洗面化粧台タイプ,,エスタ/ベッセルタイプ,NTYAN-60E5HY･MNS-451K,,売れ筋セット,間口=600,,,
/SENMEN/ESTBES/,NTAN75E5HY_A,NTAN75E5HY_B,NTAN75E5HY_C,NTAN75E5HY_D,,,,,洗面化粧室,住宅,洗面化粧台タイプ,,エスタ/ベッセルタイプ,NTYAN-75E5HY,,化粧台本体,間口＝750,,,
/SENMEN/ESTBES/,NTAN75E5HY_601K_A,NTAN75E5HY_601K_B,NTAN75E5HY_601K_C,NTAN75E5HY_601K_D,,,,,洗面化粧室,住宅,洗面化粧台タイプ,,エスタ/ベッセルタイプ,NTYAN-75E5HY･MNS-601K,,売れ筋セット,間口=750,,,
/SENMEN/ESTBES/,NTAN90E5HY_751K_A,NTAN90E5HY_751K_B,NTAN90E5HY_751K_C,NTAN90E5HY_751K_D,,,,,洗面化粧室,住宅,洗面化粧台タイプ,,エスタ/ベッセルタイプ,NTYAN-90E5HY･MNS-751K,,売れ筋セット,間口=900,,,
/SENMEN/ESTBES/,YL2841_LFYE340SYHCMB_A,YL2841_LFYE340SYHCMB_B,YL2841_LFYE340SYHCMB_C,YL2841_LFYE340SYHCMB_D,,,,,洗面化粧室,住宅,洗面化粧台タイプ,,エスタ/ベッセルタイプ,YL-2841･LF-YE340SYHC-MB,,水栓金具+洗面器,,,,
/SENMEN/ESTBES/,YL537_LFE360SYMB10_A,YL537_LFE360SYMB10_B,YL537_LFE360SYMB10_C,YL537_LFE360SYMB10_D,,,,,洗面化粧室,住宅,洗面化粧台タイプ,,エスタ/ベッセルタイプ,YL-537･LF-E360SY-MB10,W=750以上で組合せ可能,水栓金具+洗面器,,,,
/SENMEN/ESTBES/,YL543_LFWF340SY_MB_A,YL543_LFWF340SY_MB_B,YL543_LFWF340SY_MB_C,YL543_LFWF340SY_MB_D,,,,,洗面化粧室,住宅,洗面化粧台タイプ,,エスタ/ベッセルタイプ,YL-543･LF-WF340SY-MB,,水栓金具+洗面器,,,,
/SENMEN/ESTBES/,YL543_LFYE340SYMB_A,YL543_LFYE340SYMB_B,YL543_LFYE340SYMB_C,YL543_LFYE340SYMB_D,,,,,洗面化粧室,住宅,洗面化粧台タイプ,,エスタ/ベッセルタイプ,YL-543･LF-YE340SY-MB,,水栓金具+洗面器,,,,
/SENMEN/ESTBES/,YL555_LFWF340SY_MB_A,YL555_LFWF340SY_MB_B,YL555_LFWF340SY_MB_C,YL555_LFWF340SY_MB_D,,,,,洗面化粧室,住宅,洗面化粧台タイプ,,エスタ/ベッセルタイプ,YL-555･LF-WF340SY-MB,,水栓金具+洗面器,,,,
/SENMEN/ESTBES/,YL555_LFYE340SYMB_A,YL555_LFYE340SYMB_B,YL555_LFYE340SYMB_C,YL555_LFYE340SYMB_D,,,,,洗面化粧室,住宅,洗面化粧台タイプ,,エスタ/ベッセルタイプ,YL-555･LF-YE340SY-MB,,水栓金具+洗面器,,,,
/SENMEN/ESTBES/,NSG300NT(1200)C1A_A,NSG300NT(1200)C1A_B,NSG300NT(1200)C1A_C,NSG300NT(1200)C1A_D,,,,,洗面化粧室,住宅,洗面化粧台タイプ,,エスタ/ベッセル手洗タイプ,NSG-300NR(1200)L1A,,化粧台本体,間口＝1200,,,
/SENMEN/ESTBES/,NSG300NT(900)C1A_A,NSG300NT(900)C1A_B,NSG300NT(900)C1A_C,NSG300NT(900)C1A_D,,,,,洗面化粧室,住宅,洗面化粧台タイプ,,エスタ/ベッセル手洗タイプ,NSG-300NS(900)C1A,,化粧台本体,間口＝900,,,
/SENMEN/ESTBES/,NSG300NT(600)C1A_A,NSG300NT(600)C1A_B,NSG300NT(600)C1A_C,NSG300NT(600)C1A_D,,,,,洗面化粧室,住宅,洗面化粧台タイプ,,エスタ/ベッセル手洗タイプ,NSG-300NT(600)C1A,,化粧台本体,間口＝600,,,
/SENMEN/ESTBES/,NSG300NT(750)C1A_A,NSG300NT(750)C1A_B,NSG300NT(750)C1A_C,NSG300NT(750)C1A_D,,,,,洗面化粧室,住宅,洗面化粧台タイプ,,エスタ/ベッセル手洗タイプ,NSG-300NT(750)C1A,,化粧台本体,間口＝750,,,
/SENMEN/ESTBES/,LFE01H_MB_A,LFE01H_MB_B,LFE01H_MB_C,LFE01H_MB_D,,,,,洗面化粧室,住宅,洗面化粧台タイプ,,エスタ/ベッセル手洗タイプ/水栓金具,LF-E01H-MB,,手動,,,,
/SENMEN/ESTBOW/,LFE345SYC_MB2_A,LFE345SYC_MB2_B,LFE345SYC_MB2_C,LFE345SYC_MB2_D,,,,,洗面化粧室,住宅,洗面化粧台タイプ,,エスタ/ボウル一体タイプ,LF-E340SYC-MB10,,水栓金具,,,,
/SENMEN/ESTBOW/,LFE340SYC_MB4_A,LFE340SYC_MB4_B,LFE340SYC_MB4_C,LFE340SYC_MB4_D,,,,,洗面化粧室,住宅,洗面化粧台タイプ,,エスタ/ボウル一体タイプ,LF-E345SYC-MB11,,水栓金具,,,,
/SENMEN/ESTBOW/,LFWF340SY_MB_A,LFWF340SY_MB_B,LFWF340SY_MB_C,LFWF340SY_MB_D,,,,,洗面化粧室,住宅,洗面化粧台タイプ,,エスタ/ボウル一体タイプ,LF-WF340SY-MB,,水栓金具,,,,
/SENMEN/ESTBOW/,MFTX1751XFJ_A,MFTX1751XFJ_B,MFTX1751XFJ_C,MFTX1751XFJ_D,,,,,洗面化粧室,住宅,洗面化粧台タイプ,,エスタ/ボウル一体タイプ,MFTX1-751XFJ-N,,ミラーキャビネット,間口＝750,,,
/SENMEN/ESTBOW/,MFTX1751XFJ_A,MFTX1751XFJ_B,MFTX1751XFJ_C,MFTX1751XFJ_D,,,,,洗面化粧室,住宅,洗面化粧台タイプ,,エスタ/ボウル一体タイプ,MFTX1-751XFJU-N,,ミラーキャビネット,間口＝750,,,
/SENMEN/ESTBOW/,MFTX751XPJN_A,MFTX751XPJN_B,MFTX751XPJN_C,MFTX751XPJN_D,,,,,洗面化粧室,住宅,洗面化粧台タイプ,,エスタ/ボウル一体タイプ,MFTX1-751XPJ-N,,ミラーキャビネット,間口＝750,,,
/SENMEN/ESTBOW/,MFTX751XPJN_A,MFTX751XPJN_B,MFTX751XPJN_C,MFTX751XPJN_D,,,,,洗面化粧室,住宅,洗面化粧台タイプ,,エスタ/ボウル一体タイプ,MFTX1-751XPJU-N,,ミラーキャビネット,間口＝750,,,
/SENMEN/ESTBOW/,MFTX1751YFJ_A,MFTX1751YFJ_B,MFTX1751YFJ_C,MFTX1751YFJ_D,,,,,洗面化粧室,住宅,洗面化粧台タイプ,,エスタ/ボウル一体タイプ,MFTX1-751YFJ-N,,ミラーキャビネット,間口＝750,,,
/SENMEN/ESTBOW/,MFTX1751YFJ_A,MFTX1751YFJ_B,MFTX1751YFJ_C,MFTX1751YFJ_D,,,,,洗面化粧室,住宅,洗面化粧台タイプ,,エスタ/ボウル一体タイプ,MFTX1-751YFJU-N,,ミラーキャビネット,間口＝750,,,
/SENMEN/ESTBOW/,MFTX751YPJN_A,MFTX751YPJN_B,MFTX751YPJN_C,MFTX751YPJN_D,,,,,洗面化粧室,住宅,洗面化粧台タイプ,,エスタ/ボウル一体タイプ,MFTX1-751YPJ-N,,ミラーキャビネット,間口＝750,,,
/SENMEN/ESTBOW/,MFTX751YPJN_A,MFTX751YPJN_B,MFTX751YPJN_C,MFTX751YPJN_D,,,,,洗面化粧室,住宅,洗面化粧台タイプ,,エスタ/ボウル一体タイプ,MFTX1-751YPJU-N,,ミラーキャビネット,間口＝750,,,
/SENMEN/ESTBOW/,MNS751XJU_A,MNS751XJU_B,MNS751XJU_C,MNS751XJU_D,,,,,洗面化粧室,住宅,洗面化粧台タイプ,,エスタ/ボウル一体タイプ,MNS1-751XJU,,ミラーキャビネット,間口＝750,,,
/SENMEN/ESTBES/,MNS451N_A,MNS451N_B,MNS451N_C,MNS451N_D,,,,,洗面化粧室,住宅,洗面化粧台タイプ,,エスタ/ボウル一体タイプ,MNS-451N,,ミラーキャビネット,間口＝450,,,
/SENMEN/ESTBOW/,MNS451NX_A,MNS451NX_B,MNS451NX_C,MNS451NX_D,,,,,洗面化粧室,住宅,洗面化粧台タイプ,,エスタ/ボウル一体タイプ,MNS-451NX,,ミラーキャビネット,間口＝450,,,
/SENMEN/ESTBES/,MNS551K_NSK201C_A,MNS551K_NSK201C_B,MNS551K_NSK201C_C,MNS551K_NSK201C_D,,,,,洗面化粧室,住宅,洗面化粧台タイプ,,エスタ/ボウル一体タイプ,MNS-551K･NSK-201C,,ミラーキャビネット,間口＝750,,,
/SENMEN/ESTBES/,MNS551K_NSKO201_A,MNS551K_NSKO201_B,MNS551K_NSKO201_C,MNS551K_NSKO201_D,,,,,洗面化粧室,住宅,洗面化粧台タイプ,,エスタ/ボウル一体タイプ,MNS-551K･NSKO-201,,ミラーキャビネット,間口＝750,,,
/SENMEN/ESTBES/,MNS751K_A,MNS751K_B,MNS751K_C,MNS751K_D,,,,,洗面化粧室,住宅,洗面化粧台タイプ,,エスタ/ボウル一体タイプ,MNS-751K,,ミラーキャビネット,間口＝750,,,
/SENMEN/ESTBOW/,NSV1440NT1200LG_NSVN604A_A,NSV1440NT1200LG_NSVN604A_B,NSV1440NT1200LG_NSVN604A_C,NSV1440NT1200LG_NSVN604A_D,,,,,洗面化粧室,住宅,洗面化粧台タイプ,,エスタ/ボウル一体タイプ,NSV1-440NT(1200)LG･NSVN-604A･BB-NSV-T(560)･NSVE-040A･MNS-601K･NSK-301C･NSK-301C,,おすすめセット,間口＝1200,,,