﻿パス,詳細図平面図,詳細図正面図,詳細図右側面図,詳細図左側面図,意匠図平面図,意匠図正面図,意匠図右側面図,意匠図左側面図,第1分類,第2分類,第3分類,第4分類,品名,品番,注記,仕様1,仕様2,仕様3,仕様4,仕様5
/KYUUTOU/DENON_P2/,EHPNKA12ECV2_SA,EHPNKA12ECV2_SB,EHPNKA12ECV2_SC,,,,,,小型電気温水器,パブリック向け小型電気温水器,福祉施設・オフィスのキッチン（飲料・洗い物）,,小型電気温水器(飲料・洗い物用),EHPN-KA12ECV3,,パブリック向け,飲料用・洗い物用,スーパー節電タイプ,,
/KYUUTOU/DENON_P2/,EHPNKA12ECV2_SA,EHPNKA12ECV2_SB,EHPNKA12ECV2_SC,,,,,,小型電気温水器,パブリック向け小型電気温水器,福祉施設・オフィスのキッチン（飲料・洗い物）,,小型電気温水器(飲料・洗い物用),EHPN-KB12ECV3,,パブリック向け,飲料用・洗い物用,スーパー節電タイプ,,
/KYUUTOU/DENON_P2/,EHPNKB25ECV2_SA,EHPNKB25ECV2_SB,EHPNKB25ECV2_SC,,,,,,小型電気温水器,パブリック向け小型電気温水器,福祉施設・オフィスのキッチン（飲料・洗い物）,,小型電気温水器(飲料・洗い物用),EHPN-KB25ECV3,,パブリック向け,飲料用・洗い物用,スーパー節電タイプ,,
/KYUUTOU/DENON_P3/,EHPNKWA12ECV1_SA,EHPNKWA12ECV1_SB,,EHPNKWA12ECV1_SD,,,,,小型電気温水器,パブリック向け小型電気温水器,福祉施設・オフィスのキッチン（飲料・洗い物）,,小型電気温水器(飲料・洗い物用),EHPN-KWA12ECV1,,パブリック向け,飲料用・洗い物用,スーパー節電タイプ,,
/KYUUTOU/DENON_P3/,EHPNKWA20ECV1_SA,EHPNKWA20ECV1_SB,,EHPNKWA20ECV1_SD,,,,,小型電気温水器,パブリック向け小型電気温水器,福祉施設・オフィスのキッチン（飲料・洗い物）,,小型電気温水器(飲料・洗い物用),EHPN-KWA20ECV1,,パブリック向け,飲料用・洗い物用,スーパー節電タイプ,,
/KYUUTOU/DENON_P3/,EHPNKWA30ECV1_SA,EHPNKWA30ECV1_SB,,EHPNKWA30ECV1_SD,,,,,小型電気温水器,パブリック向け小型電気温水器,福祉施設・オフィスのキッチン（飲料・洗い物）,,小型電気温水器(飲料・洗い物用),EHPN-KWA30ECV1,,パブリック向け,飲料用・洗い物用,スーパー節電タイプ,,
/KYUUTOU/DENON_P3/,EHPNKWA12ECV1_SA,EHPNKWA12ECV1_SB,,EHPNKWA12ECV1_SD,,,,,小型電気温水器,パブリック向け小型電気温水器,福祉施設・オフィスのキッチン（飲料・洗い物）,,小型電気温水器(飲料・洗い物用),EHPN-KWB12ECV1,,パブリック向け,飲料用・洗い物用,スーパー節電タイプ,,
/KYUUTOU/DENON_P3/,EHPNKWA20ECV1_SA,EHPNKWA20ECV1_SB,,EHPNKWA20ECV1_SD,,,,,小型電気温水器,パブリック向け小型電気温水器,福祉施設・オフィスのキッチン（飲料・洗い物）,,小型電気温水器(飲料・洗い物用),EHPN-KWB20ECV1,,パブリック向け,飲料用・洗い物用,スーパー節電タイプ,,
/KYUUTOU/DENON_P3/,EHPNKWA30ECV1_SA,EHPNKWA30ECV1_SB,,EHPNKWA30ECV1_SD,,,,,小型電気温水器,パブリック向け小型電気温水器,福祉施設・オフィスのキッチン（飲料・洗い物）,,小型電気温水器(飲料・洗い物用),EHPN-KWB30ECV1,,パブリック向け,飲料用・洗い物用,スーパー節電タイプ,,
/KYUUTOU/DENON_P/,EHMNCA3ECSC1_300_SA,EHMNCA3ECSC1_300_SB,EHMNCA3ECSC1_300_SC,,,,,,小型電気温水器,パブリック向け小型電気温水器,,,小型電気温水器(洗面･手洗用),EHMN-CA3ECSC1-300,,パブリック向け,自動水栓セット壁掛適温出湯タイプ,オートマージュA,ポップアップあり,オートウィークリータイマー
/KYUUTOU/DENON_P/,EHMNCA3ECSC1_300C_SA,EHMNCA3ECSC1_300C_SB,EHMNCA3ECSC1_300C_SC,,,,,,小型電気温水器,パブリック向け小型電気温水器,,,小型電気温水器(洗面･手洗用),EHMN-CA3ECSC1-300C,,パブリック向け,自動水栓セット壁掛適温出湯タイプ,オートマージュA,ポップアップなし,オートウィークリータイマー
/KYUUTOU/DENON_P/,EHMNCA3ECSC1_320_SA,EHMNCA3ECSC1_320_SB,EHMNCA3ECSC1_320_SC,,,,,,小型電気温水器,パブリック向け小型電気温水器,,,小型電気温水器(洗面･手洗用),EHMN-CA3ECSC1-320,,パブリック向け,自動水栓セット壁掛適温出湯タイプ,オートマージュMX,ポップアップあり,オートウィークリータイマー
/KYUUTOU/DENON_P/,EHMNCA3ECSC1_320C_SA,EHMNCA3ECSC1_320C_SB,EHMNCA3ECSC1_320C_SC,,,,,,小型電気温水器,パブリック向け小型電気温水器,,,小型電気温水器(洗面･手洗用),EHMN-CA3ECSC1-320C,,パブリック向け,自動水栓セット壁掛適温出湯タイプ,オートマージュMX,ポップアップなし,オートウィークリータイマー
/KYUUTOU/DENON_P/,EHMNCA3ECSC1_320HC_SA,EHMNCA3ECSC1_320HC_SB,EHMNCA3ECSC1_320HC_SC,,,,,,小型電気温水器,パブリック向け小型電気温水器,,,小型電気温水器(洗面･手洗用),EHMN-CA3ECSC1-320HC,,パブリック向け,自動水栓セット壁掛適温出湯タイプ,オートマージュMX ベッセル用ロング,ポップアップなし,オートウィークリータイマー
/KYUUTOU/DENON_P/,EHMNCA3ECSC1_330C_SA,EHMNCA3ECSC1_330C_SB,EHMNCA3ECSC1_330C_SC,,,,,,小型電気温水器,パブリック向け小型電気温水器,,,小型電気温水器(洗面・手洗用),EHMN-CA3ECSC1-330C,,パブリック向け,自動水栓一体型壁掛適温出湯タイプ,オートマージュGX　ポップアップなし,適温出湯オートウィークリータイマータイプ,
/KYUUTOU/DENON_P/,EHMNCA3ECSC1_330HC_SA,EHMNCA3ECSC1_330HC_SB,EHMNCA3ECSC1_330HC_SC,,,,,,小型電気温水器,パブリック向け小型電気温水器,,,小型電気温水器(洗面・手洗用),EHMN-CA3ECSC1-330HC,,パブリック向け,自動水栓一体型壁掛適温出湯タイプ,オートマージュGXベッセル用ロングタイプ　ポップアップなし,適温出湯オートウィークリータイマータイプ,
/KYUUTOU/DENON_P/,EHMNCA3ECSC1_L_300_SA,EHMNCA3ECSC1_L_300_SB,EHMNCA3ECSC1_L_300_SC,,,,,,小型電気温水器,パブリック向け小型電気温水器,,,小型電気温水器(洗面･手洗用),EHMN-CA3ECSC1-L-300,,パブリック向け,自動水栓セット壁掛適温出湯タイプ,オートマージュA,ポップアップあり,オートウィークリータイマー
/KYUUTOU/DENON_P/,EHMNCA3ECSC1_L_300C_SA,EHMNCA3ECSC1_L_300C_SB,EHMNCA3ECSC1_L_300C_SC,,,,,,小型電気温水器,パブリック向け小型電気温水器,,,小型電気温水器(洗面･手洗用),EHMN-CA3ECSC1-L-300C,,パブリック向け,自動水栓セット壁掛適温出湯タイプ,オートマージュA,ポップアップなし,オートウィークリータイマー
/KYUUTOU/DENON_P/,EHMNCA3ECSC2_301_SA,EHMNCA3ECSC2_301_SB,EHMNCA3ECSC2_301_SC,,,,,,小型電気温水器,パブリック向け小型電気温水器,,,小型電気温水器(洗面･手洗用),EHMN-CA3ECSC2-301,,パブリック向け,自動水栓セット壁掛適温出湯タイプ,オートマージュA,ポップアップあり,オートウィークリータイマー
/KYUUTOU/DENON_P/,EHMNCA3ECSC2_321_SA,EHMNCA3ECSC2_321_SB,EHMNCA3ECSC2_321_SC,,,,,,小型電気温水器,パブリック向け小型電気温水器,,,小型電気温水器(洗面･手洗用),EHMN-CA3ECSC2-321,,パブリック向け,自動水栓セット壁掛適温出湯タイプ,オートマージュMX,ポップアップあり,オートウィークリータイマー
/KYUUTOU/DENON_P/,EHMNCA3ECSC3_303_SA,EHMNCA3ECSC3_303_SB,EHMNCA3ECSC3_303_SC,,,,,,小型電気温水器,パブリック向け小型電気温水器,,,小型電気温水器(洗面･手洗用),EHMN-CA3ECSC3-303,,パブリック向け,自動水栓セット壁掛適温出湯タイプ,オートマージュA,ポップアップあり,オートウィークリータイマー
/KYUUTOU/DENON_P/,EHMNCA3ECSC3_323_SA,EHMNCA3ECSC3_323_SB,EHMNCA3ECSC3_323_SC,,,,,,小型電気温水器,パブリック向け小型電気温水器,,,小型電気温水器(洗面･手洗用),EHMN-CA3ECSC3-323,,パブリック向け,自動水栓セット壁掛適温出湯タイプ,オートマージュMX,ポップアップあり,オートウィークリータイマー
/KYUUTOU/DENON_P/,EHMNCA3ECSD2_311_SA,EHMNCA3ECSD2_311_SB,EHMNCA3ECSD2_311_SC,,,,,,小型電気温水器,パブリック向け小型電気温水器,,,小型電気温水器(洗面･手洗用),EHMN-CA3ECSD2-311,,パブリック向け,自動水栓セット壁掛適温出湯タイプ,グースネック,ポップアップあり,オートウィークリータイマー
/KYUUTOU/DENON_P/,EHMNCA3ECSD2_311C_SA,EHMNCA3ECSD2_311C_SB,EHMNCA3ECSD2_311C_SC,,,,,,小型電気温水器,パブリック向け小型電気温水器,,,小型電気温水器(洗面･手洗用),EHMN-CA3ECSD2-311C,,パブリック向け,自動水栓セット壁掛適温出湯タイプ,グースネック,ポップアップなし,オートウィークリータイマー
/KYUUTOU/DENON_P/,EHMNCA3ECSD3_313_SA,EHMNCA3ECSD3_313_SB,EHMNCA3ECSD3_313_SC,,,,,,小型電気温水器,パブリック向け小型電気温水器,,,小型電気温水器(洗面･手洗用),EHMN-CA3ECSD3-313,,パブリック向け,自動水栓セット壁掛適温出湯タイプ,グースネック,ポップアップあり,オートウィークリータイマー
/KYUUTOU/DENON_P/,EHMNCA3ECSD3_313C_SA,EHMNCA3ECSD3_313C_SB,EHMNCA3ECSD3_313C_SC,,,,,,小型電気温水器,パブリック向け小型電気温水器,,,小型電気温水器(洗面･手洗用),EHMN-CA3ECSD3-313C,,パブリック向け,自動水栓セット壁掛適温出湯タイプ,グースネック,ポップアップなし,オートウィークリータイマー
/KYUUTOU/DENON_P/,EHMNCA3SC1_300_SA,EHMNCA3SC1_300_SB,EHMNCA3SC1_300_SC,,,,,,小型電気温水器,パブリック向け小型電気温水器,,,小型電気温水器(洗面･手洗用),EHMN-CA3SC1-300,,パブリック向け,自動水栓セット壁掛適温出湯タイプ,オートマージュA,ポップアップあり,
/KYUUTOU/DENON_P/,EHMNCA3SC1_300C_SA,EHMNCA3SC1_300C_SB,EHMNCA3SC1_300C_SC,,,,,,小型電気温水器,パブリック向け小型電気温水器,,,小型電気温水器(洗面･手洗用),EHMN-CA3SC1-300C,,パブリック向け,自動水栓セット壁掛適温出湯タイプ,オートマージュA,ポップアップなし,
/KYUUTOU/DENON_P/,EHMNCA3SC1_320_SA,EHMNCA3SC1_320_SB,EHMNCA3SC1_320_SC,,,,,,小型電気温水器,パブリック向け小型電気温水器,,,小型電気温水器(洗面･手洗用),EHMN-CA3SC1-320,,パブリック向け,自動水栓セット壁掛適温出湯タイプ,オートマージュMX,ポップアップあり,
/KYUUTOU/DENON_P/,EHMNCA3SC1_320C_SA,EHMNCA3SC1_320C_SB,EHMNCA3SC1_320C_SC,,,,,,小型電気温水器,パブリック向け小型電気温水器,,,小型電気温水器(洗面･手洗用),EHMN-CA3SC1-320C,,パブリック向け,自動水栓セット壁掛適温出湯タイプ,オートマージュMX,ポップアップなし,
/KYUUTOU/DENON_P/,EHMNCA3SC1_320HC_SA,EHMNCA3SC1_320HC_SB,EHMNCA3SC1_320HC_SC,,,,,,小型電気温水器,パブリック向け小型電気温水器,,,小型電気温水器(洗面･手洗用),EHMN-CA3SC1-320HC,,パブリック向け,自動水栓セット壁掛適温出湯タイプ,オートマージュMX ベッセル用ロング,ポップアップなし,
/KYUUTOU/DENON_P/,EHMNCA3SC1_330C_SA,EHMNCA3SC1_330C_SB,EHMNCA3SC1_330C_SC,,,,,,小型電気温水器,パブリック向け小型電気温水器,,,小型電気温水器(洗面・手洗用),EHMN-CA3SC1-330C,,パブリック向け,自動水栓一体型壁掛適温出湯タイプ,オートマージュGX　ポップアップなし,適温出湯タイプ,
/KYUUTOU/DENON_P/,EHMNCA3SC1_330HC_SA,EHMNCA3SC1_330HC_SB,EHMNCA3SC1_330HC_SC,,,,,,小型電気温水器,パブリック向け小型電気温水器,,,小型電気温水器(洗面・手洗用),EHMN-CA3SC1-330HC,,パブリック向け,自動水栓一体型壁掛適温出湯タイプ,オートマージュGXベッセル用ロングタイプ　ポップアップなし,適温出湯タイプ,
/KYUUTOU/DENON_P/,EHMNCA3SC1_L_300_SA,EHMNCA3SC1_L_300_SB,EHMNCA3SC1_L_300_SC,,,,,,小型電気温水器,パブリック向け小型電気温水器,,,小型電気温水器(洗面･手洗用),EHMN-CA3SC1-L-300,,パブリック向け,自動水栓セット壁掛適温出湯タイプ,オートマージュA,ポップアップあり,
/KYUUTOU/DENON_P/,EHMNCA3SC1_L_300C_SA,EHMNCA3SC1_L_300C_SB,EHMNCA3SC1_L_300C_SC,,,,,,小型電気温水器,パブリック向け小型電気温水器,,,小型電気温水器(洗面･手洗用),EHMN-CA3SC1-L-300C,,パブリック向け,自動水栓セット壁掛適温出湯タイプ,オートマージュA,ポップアップなし,
/KYUUTOU/DENON_P/,EHMNCA3SC2_301_SA,EHMNCA3SC2_301_SB,EHMNCA3SC2_301_SC,,,,,,小型電気温水器,パブリック向け小型電気温水器,,,小型電気温水器(洗面･手洗用),EHMN-CA3SC2-301,,パブリック向け,自動水栓セット壁掛適温出湯タイプ,オートマージュA,ポップアップあり,
/KYUUTOU/DENON_P/,EHMNCA3SC2_321_SA,EHMNCA3SC2_321_SB,EHMNCA3SC2_321_SC,,,,,,小型電気温水器,パブリック向け小型電気温水器,,,小型電気温水器(洗面･手洗用),EHMN-CA3SC2-321,,パブリック向け,自動水栓セット壁掛適温出湯タイプ,オートマージュMX,ポップアップあり,
/KYUUTOU/DENON_P/,EHMNCA3SC3_303_SA,EHMNCA3SC3_303_SB,EHMNCA3SC3_303_SC,,,,,,小型電気温水器,パブリック向け小型電気温水器,,,小型電気温水器(洗面･手洗用),EHMN-CA3SC3-303,,パブリック向け,自動水栓セット壁掛適温出湯タイプ,オートマージュA,ポップアップあり,
/KYUUTOU/DENON_P/,EHMNCA3SC3_323_SA,EHMNCA3SC3_323_SB,EHMNCA3SC3_323_SC,,,,,,小型電気温水器,パブリック向け小型電気温水器,,,小型電気温水器(洗面･手洗用),EHMN-CA3SC3-323,,パブリック向け,自動水栓セット壁掛適温出湯タイプ,オートマージュMX,ポップアップあり,
/KYUUTOU/DENON_P/,EHMNCA3SD2_311_SA,EHMNCA3SD2_311_SB,EHMNCA3SD2_311_SC,,,,,,小型電気温水器,パブリック向け小型電気温水器,,,小型電気温水器(洗面･手洗用),EHMN-CA3SD2-311,,パブリック向け,自動水栓セット壁掛適温出湯タイプ,グースネック,ポップアップあり,
/KYUUTOU/DENON_P/,EHMNCA3SD2_311C_SA,EHMNCA3SD2_311C_SB,EHMNCA3SD2_311C_SC,,,,,,小型電気温水器,パブリック向け小型電気温水器,,,小型電気温水器(洗面･手洗用),EHMN-CA3SD2-311C,,パブリック向け,自動水栓セット壁掛適温出湯タイプ,グースネック,ポップアップなし,
/KYUUTOU/DENON_P/,EHMNCA3SD3_313_SA,EHMNCA3SD3_313_SB,EHMNCA3SD3_313_SC,,,,,,小型電気温水器,パブリック向け小型電気温水器,,,小型電気温水器(洗面･手洗用),EHMN-CA3SD3-313,,パブリック向け,自動水栓セット壁掛適温出湯タイプ,グースネック,ポップアップあり,
/KYUUTOU/DENON_P/,EHMNCA3SD3_313C_SA,EHMNCA3SD3_313C_SB,EHMNCA3SD3_313C_SC,,,,,,小型電気温水器,パブリック向け小型電気温水器,,,小型電気温水器(洗面･手洗用),EHMN-CA3SD3-313C,,パブリック向け,自動水栓セット壁掛適温出湯タイプ,グースネック,ポップアップなし,
/KYUUTOU/DENON_P/,EHMNCA6ECSC1_300_SA,EHMNCA6ECSC1_300_SB,EHMNCA6ECSC1_300_SC,,,,,,小型電気温水器,パブリック向け小型電気温水器,,,小型電気温水器(洗面･手洗用),EHMN-CA6ECSC1-300,,パブリック向け,自動水栓セット壁掛適温出湯タイプ,オートマージュA,ポップアップあり,オートウィークリータイマー
/KYUUTOU/DENON_P/,EHMNCA6ECSC1_300C_SA,EHMNCA6ECSC1_300C_SB,EHMNCA6ECSC1_300C_SC,,,,,,小型電気温水器,パブリック向け小型電気温水器,,,小型電気温水器(洗面･手洗用),EHMN-CA6ECSC1-300C,,パブリック向け,自動水栓セット壁掛適温出湯タイプ,オートマージュA,ポップアップなし,オートウィークリータイマー
/KYUUTOU/DENON_P/,EHMNCA6ECSC1_320_SA,EHMNCA6ECSC1_320_SB,EHMNCA6ECSC1_320_SC,,,,,,小型電気温水器,パブリック向け小型電気温水器,,,小型電気温水器(洗面･手洗用),EHMN-CA6ECSC1-320,,パブリック向け,自動水栓セット壁掛適温出湯タイプ,オートマージュMX,ポップアップあり,オートウィークリータイマー
/KYUUTOU/DENON_P/,EHMNCA6ECSC1_320C_SA,EHMNCA6ECSC1_320C_SB,EHMNCA6ECSC1_320C_SC,,,,,,小型電気温水器,パブリック向け小型電気温水器,,,小型電気温水器(洗面･手洗用),EHMN-CA6ECSC1-320C,,パブリック向け,自動水栓セット壁掛適温出湯タイプ,オートマージュMX,ポップアップなし,オートウィークリータイマー
/KYUUTOU/DENON_P/,EHMNCA6ECSC1_320HC_SA,EHMNCA6ECSC1_320HC_SB,EHMNCA6ECSC1_320HC_SC,,,,,,小型電気温水器,パブリック向け小型電気温水器,,,小型電気温水器(洗面･手洗用),EHMN-CA6ECSC1-320HC,,パブリック向け,自動水栓セット壁掛適温出湯タイプ,オートマージュMX ベッセル用ロング,ポップアップなし,オートウィークリータイマー
/KYUUTOU/DENON_P/,EHMNCA6ECSC1_330C_SA,EHMNCA6ECSC1_330C_SB,EHMNCA6ECSC1_330C_SC,,,,,,小型電気温水器,パブリック向け小型電気温水器,,,小型電気温水器(洗面・手洗用),EHMN-CA6ECSC1-330C,,パブリック向け,自動水栓一体型適温出湯タイプ,オートマージュGX　ポップアップなし,適温出湯オートウィークリータイマータイプ,
/KYUUTOU/DENON_P/,EHMNCA6ECSC1_330HC_SA,EHMNCA6ECSC1_330HC_SB,EHMNCA6ECSC1_330HC_SC,,,,,,小型電気温水器,パブリック向け小型電気温水器,,,小型電気温水器(洗面・手洗用),EHMN-CA6ECSC1-330HC,,パブリック向け,自動水栓一体型適温出湯タイプ,オートマージュGXベッセル用ロングタイプ　ポップアップなし,適温出湯オートウィークリータイマータイプ,
/KYUUTOU/DENON_P/,EHMNCA6ECSC2_301_SA,EHMNCA6ECSC2_301_SB,EHMNCA6ECSC2_301_SC,,,,,,小型電気温水器,パブリック向け小型電気温水器,,,小型電気温水器(洗面･手洗用),EHMN-CA6ECSC2-301,,パブリック向け,自動水栓セット壁掛適温出湯タイプ,オートマージュA,ポップアップあり,オートウィークリータイマー
/KYUUTOU/DENON_P/,EHMNCA6ECSC2_321_SA,EHMNCA6ECSC2_321_SB,EHMNCA6ECSC2_321_SC,,,,,,小型電気温水器,パブリック向け小型電気温水器,,,小型電気温水器(洗面･手洗用),EHMN-CA6ECSC2-321,,パブリック向け,自動水栓セット壁掛適温出湯タイプ,オートマージュMX,ポップアップあり,オートウィークリータイマー
/KYUUTOU/DENON_P/,EHMNCA6ECSC3_303_SA,EHMNCA6ECSC3_303_SB,EHMNCA6ECSC3_303_SC,,,,,,小型電気温水器,パブリック向け小型電気温水器,,,小型電気温水器(洗面･手洗用),EHMN-CA6ECSC3-303,,パブリック向け,自動水栓セット壁掛適温出湯タイプ,オートマージュA,ポップアップあり,オートウィークリータイマー
/KYUUTOU/DENON_P/,EHMNCA6ECSC3_323_SA,EHMNCA6ECSC3_323_SB,EHMNCA6ECSC3_323_SC,,,,,,小型電気温水器,パブリック向け小型電気温水器,,,小型電気温水器(洗面･手洗用),EHMN-CA6ECSC3-323,,パブリック向け,自動水栓セット壁掛適温出湯タイプ,オートマージュMX,ポップアップあり,オートウィークリータイマー
/KYUUTOU/DENON_P/,EHMNCA6ECSD2_311_SA,EHMNCA6ECSD2_311_SB,EHMNCA6ECSD2_311_SC,,,,,,小型電気温水器,パブリック向け小型電気温水器,,,小型電気温水器(洗面･手洗用),EHMN-CA6ECSD2-311,,パブリック向け,自動水栓セット壁掛適温出湯タイプ,グースネック,ポップアップあり,オートウィークリータイマー
/KYUUTOU/DENON_P/,EHMNCA6ECSD2_311C_SA,EHMNCA6ECSD2_311C_SB,EHMNCA6ECSD2_311C_SC,,,,,,小型電気温水器,パブリック向け小型電気温水器,,,小型電気温水器(洗面･手洗用),EHMN-CA6ECSD2-311C,,パブリック向け,自動水栓セット壁掛適温出湯タイプ,グースネック,ポップアップなし,オートウィークリータイマー
/KYUUTOU/DENON_P/,EHMNCA6ECSD3_313_SA,EHMNCA6ECSD3_313_SB,EHMNCA6ECSD3_313_SC,,,,,,小型電気温水器,パブリック向け小型電気温水器,,,小型電気温水器(洗面･手洗用),EHMN-CA6ECSD3-313,,パブリック向け,自動水栓セット壁掛適温出湯タイプ,グースネック,ポップアップあり,オートウィークリータイマー
/KYUUTOU/DENON_P/,EHMNCA6ECSD3_313C_SA,EHMNCA6ECSD3_313C_SB,EHMNCA6ECSD3_313C_SC,,,,,,小型電気温水器,パブリック向け小型電気温水器,,,小型電気温水器(洗面･手洗用),EHMN-CA6ECSD3-313C,,パブリック向け,自動水栓セット壁掛適温出湯タイプ,グースネック,ポップアップなし,オートウィークリータイマー
/KYUUTOU/DENON_P/,EHMNCA6SC1_300_SA,EHMNCA6SC1_300_SB,EHMNCA6SC1_300_SC,,,,,,小型電気温水器,パブリック向け小型電気温水器,,,小型電気温水器(洗面･手洗用),EHMN-CA6SC1-300,,パブリック向け,自動水栓セット壁掛適温出湯タイプ,オートマージュA,ポップアップあり,
/KYUUTOU/DENON_P/,EHMNCA6SC1_300C_SA,EHMNCA6SC1_300C_SB,EHMNCA6SC1_300C_SC,,,,,,小型電気温水器,パブリック向け小型電気温水器,,,小型電気温水器(洗面･手洗用),EHMN-CA6SC1-300C,,パブリック向け,自動水栓セット壁掛適温出湯タイプ,オートマージュA,ポップアップなし,
/KYUUTOU/DENON_P/,EHMNCA6SC1_320_SA,EHMNCA6SC1_320_SB,EHMNCA6SC1_320_SC,,,,,,小型電気温水器,パブリック向け小型電気温水器,,,小型電気温水器(洗面･手洗用),EHMN-CA6SC1-320,,パブリック向け,自動水栓セット壁掛適温出湯タイプ,オートマージュMX,ポップアップあり,
/KYUUTOU/DENON_P/,EHMNCA6SC1_320C_SA,EHMNCA6SC1_320C_SB,EHMNCA6SC1_320C_SC,,,,,,小型電気温水器,パブリック向け小型電気温水器,,,小型電気温水器(洗面･手洗用),EHMN-CA6SC1-320C,,パブリック向け,自動水栓セット壁掛適温出湯タイプ,オートマージュMX,ポップアップなし,
/KYUUTOU/DENON_P/,EHMNCA6SC1_320HC_SA,EHMNCA6SC1_320HC_SB,EHMNCA6SC1_320HC_SC,,,,,,小型電気温水器,パブリック向け小型電気温水器,,,小型電気温水器(洗面･手洗用),EHMN-CA6SC1-320HC,,パブリック向け,自動水栓セット壁掛適温出湯タイプ,オートマージュMX ベッセル用ロング,ポップアップなし,
/KYUUTOU/DENON_P/,EHMNCA6SC1_330C_SA,EHMNCA6SC1_330C_SB,EHMNCA6SC1_330C_SC,,,,,,小型電気温水器,パブリック向け小型電気温水器,,,小型電気温水器(洗面・手洗用),EHMN-CA6SC1-330C,,パブリック向け,自動水栓一体型適温出湯タイプ,オートマージュGX　ポップアップなし,適温出湯タイプ,
/KYUUTOU/DENON_P/,EHMNCA6SC1_330HC_SA,EHMNCA6SC1_330HC_SB,EHMNCA6SC1_330HC_SC,,,,,,小型電気温水器,パブリック向け小型電気温水器,,,小型電気温水器(洗面・手洗用),EHMN-CA6SC1-330HC,,パブリック向け,自動水栓一体型適温出湯タイプ,オートマージュGXベッセル用ロングタイプ　ポップアップなし,適温出湯タイプ,
/KYUUTOU/DENON_P/,EHMNCA6SC2_301_SA,EHMNCA6SC2_301_SB,EHMNCA6SC2_301_SC,,,,,,小型電気温水器,パブリック向け小型電気温水器,,,小型電気温水器(洗面･手洗用),EHMN-CA6SC2-301,,パブリック向け,自動水栓セット壁掛適温出湯タイプ,オートマージュA,ポップアップあり,
/KYUUTOU/DENON_P/,EHMNCA6SC2_321_SA,EHMNCA6SC2_321_SB,EHMNCA6SC2_321_SC,,,,,,小型電気温水器,パブリック向け小型電気温水器,,,小型電気温水器(洗面･手洗用),EHMN-CA6SC2-321,,パブリック向け,自動水栓セット壁掛適温出湯タイプ,オートマージュMX,ポップアップあり,
/KYUUTOU/DENON_P/,EHMNCA6SC3_303_SA,EHMNCA6SC3_303_SB,EHMNCA6SC3_303_SC,,,,,,小型電気温水器,パブリック向け小型電気温水器,,,小型電気温水器(洗面･手洗用),EHMN-CA6SC3-303,,パブリック向け,自動水栓セット壁掛適温出湯タイプ,オートマージュA,ポップアップあり,
/KYUUTOU/DENON_P/,EHMNCA6SC3_323_SA,EHMNCA6SC3_323_SB,EHMNCA6SC3_323_SC,,,,,,小型電気温水器,パブリック向け小型電気温水器,,,小型電気温水器(洗面･手洗用),EHMN-CA6SC3-323,,パブリック向け,自動水栓セット壁掛適温出湯タイプ,オートマージュMX,ポップアップあり,
/KYUUTOU/DENON_P/,EHMNCA6SD2_311_SA,EHMNCA6SD2_311_SB,EHMNCA6SD2_311_SC,,,,,,小型電気温水器,パブリック向け小型電気温水器,,,小型電気温水器(洗面･手洗用),EHMN-CA6SD2-311,,パブリック向け,自動水栓セット壁掛適温出湯タイプ,グースネック,ポップアップあり,
/KYUUTOU/DENON_P/,EHMNCA6SD2_311C_SA,EHMNCA6SD2_311C_SB,EHMNCA6SD2_311C_SC,,,,,,小型電気温水器,パブリック向け小型電気温水器,,,小型電気温水器(洗面･手洗用),EHMN-CA6SD2-311C,,パブリック向け,自動水栓セット壁掛適温出湯タイプ,グースネック,ポップアップなし,
/KYUUTOU/DENON_P/,EHMNCA6SD3_313_SA,EHMNCA6SD3_313_SB,EHMNCA6SD3_313_SC,,,,,,小型電気温水器,パブリック向け小型電気温水器,,,小型電気温水器(洗面･手洗用),EHMN-CA6SD3-313,,パブリック向け,自動水栓セット壁掛適温出湯タイプ,グースネック,ポップアップあり,
/KYUUTOU/DENON_P/,EHMNCA6SD3_313C_SA,EHMNCA6SD3_313C_SB,EHMNCA6SD3_313C_SC,,,,,,小型電気温水器,パブリック向け小型電気温水器,,,小型電気温水器(洗面･手洗用),EHMN-CA6SD3-313C,,パブリック向け,自動水栓セット壁掛適温出湯タイプ,グースネック,ポップアップなし,
/KYUUTOU/DENON_P2/,EHPNCA12ECS3_SA,EHPNCA12ECS3_SB,EHPNCA12ECS3_SC,,,,,,小型電気温水器,パブリック向け小型電気温水器,,,小型電気温水器(洗面･手洗用),EHPN-CA12ECS4,,パブリック向け,洗面･手洗用,適温出湯タイプ,オートウィークリータイマータイプ,
/KYUUTOU/DENON_P2/,EHPNCA12ECV3_SA,EHPNCA12ECV3_SB,EHPNCA12ECV3_SC,,,,,,小型電気温水器,パブリック向け小型電気温水器,,,小型電気温水器(洗面･手洗用),EHPN-CA12ECV4,,パブリック向け,洗面･手洗用,出湯温度可変タイプ,オートウィークリータイマータイプ,
/KYUUTOU/DENON_P2/,EHPNCA12S3_SA,EHPNCA12S3_SB,EHPNCA12S3_SC,,,,,,小型電気温水器,パブリック向け小型電気温水器,,,小型電気温水器(洗面･手洗用),EHPN-CA12S4,,パブリック向け,洗面･手洗用,適温出湯タイプ,,
/KYUUTOU/DENON_P2/,EHPNCA12V3_SA,EHPNCA12V3_SB,EHPNCA12V3_SC,,,,,,小型電気温水器,パブリック向け小型電気温水器,,,小型電気温水器(洗面･手洗用),EHPN-CA12V4,,パブリック向け,洗面･手洗用,出湯温度可変タイプ,,
/KYUUTOU/DENON_P2/,EHPNCA20ECS2_SA,EHPNCA20ECS2_SB,EHPNCA20ECS2_SC,,,,,,小型電気温水器,パブリック向け小型電気温水器,,,小型電気温水器(洗面･手洗用),EHPN-CA20ECS3,,パブリック向け,洗面･手洗用,適温出湯タイプ,オートウィークリータイマータイプ,
/KYUUTOU/DENON_P2/,EHPNCA20ECV2_SA,EHPNCA20ECV2_SB,EHPNCA20ECV2_SC,,,,,,小型電気温水器,パブリック向け小型電気温水器,,,小型電気温水器(洗面･手洗用),EHPN-CA20ECV3,,パブリック向け,洗面･手洗用,出湯温度可変タイプ,オートウィークリータイマータイプ,
/KYUUTOU/DENON_P2/,EHPNCA25ECV2_SA,EHPNCA25ECV2_SB,EHPNCA25ECV2_SC,,,,,,小型電気温水器,パブリック向け小型電気温水器,,,小型電気温水器(洗面･手洗用),EHPN-CA25ECV3,,パブリック向け,洗面･手洗用,出湯温度可変タイプ,オートウィークリータイマータイプ,
/KYUUTOU/DENON_P2/,EHPNCA25V2_SA,EHPNCA25V2_SB,EHPNCA25V2_SC,,,,,,小型電気温水器,パブリック向け小型電気温水器,,,小型電気温水器(洗面･手洗用),EHPN-CA25V3,,パブリック向け,洗面･手洗用,出湯温度可変タイプ,,
/KYUUTOU/DENON_P2/,EHPNCA3ECS1_SA,EHPNCA3ECS1_SB,EHPNCA3ECS1_SC,,,,,,小型電気温水器,パブリック向け小型電気温水器,,,小型電気温水器(洗面･手洗用),EHPN-CA3ECS2,,パブリック向け,洗面･手洗用,壁掛適温出湯タイプ,オートウィークリータイマータイプ,
/KYUUTOU/DENON_P2/,EHPNCA3S3_SA,EHPNCA3S3_SB,EHPNCA3S3_SC,,,,,,小型電気温水器,パブリック向け小型電気温水器,,,小型電気温水器(洗面･手洗用),EHPN-CA3S4,,パブリック向け,洗面･手洗用,壁掛適温出湯タイプ,,
/KYUUTOU/DENON_P2/,EHPNCA6ECS1_SA,EHPNCA6ECS1_SB,EHPNCA6ECS1_SC,,,,,,小型電気温水器,パブリック向け小型電気温水器,,,小型電気温水器(洗面･手洗用),EHPN-CA6ECS2,,パブリック向け,洗面･手洗用,適温出湯タイプ,オートウィークリータイマータイプ,
/KYUUTOU/DENON_P2/,EHPNCA6ECV1_SA,EHPNCA6ECV1_SB,EHPNCA6ECV1_SC,,,,,,小型電気温水器,パブリック向け小型電気温水器,,,小型電気温水器(洗面･手洗用),EHPN-CA6ECV2,,パブリック向け,洗面･手洗用,出湯温度可変タイプ,オートウィークリータイマータイプ,
/KYUUTOU/DENON_P2/,EHPNCA6S6_SA,EHPNCA6S6_SB,EHPNCA6S6_SC,,,,,,小型電気温水器,パブリック向け小型電気温水器,,,小型電気温水器(洗面･手洗用),EHPN-CA6S7,,パブリック向け,洗面･手洗用,適温出湯タイプ,,
/KYUUTOU/DENON_P2/,EHPNCA6V6_SA,EHPNCA6V6_SB,EHPNCA6V6_SC,,,,,,小型電気温水器,パブリック向け小型電気温水器,,,小型電気温水器(洗面･手洗用),EHPN-CA6V7,,パブリック向け,洗面･手洗用,出湯温度可変タイプ,,
/KYUUTOU/DENON_P2/,EHPNCA8ECS1_SA,EHPNCA8ECS1_SB,EHPNCA8ECS1_SC,,,,,,小型電気温水器,パブリック向け小型電気温水器,,,小型電気温水器(洗面･手洗用),EHPN-CA8ECS2,,パブリック向け,洗面･手洗用,適温出湯タイプ,オートウィークリータイマータイプ,
/KYUUTOU/DENON_P2/,EHPNCA12ECS3_SA,EHPNCA12ECS3_SB,EHPNCA12ECS3_SC,,,,,,小型電気温水器,パブリック向け小型電気温水器,,,小型電気温水器(洗面･手洗用),EHPN-CB12ECS4,,パブリック向け,洗面･手洗用,適温出湯タイプ,オートウィークリータイマータイプ,
/KYUUTOU/DENON_P2/,EHPNCA12ECV3_SA,EHPNCA12ECV3_SB,EHPNCA12ECV3_SC,,,,,,小型電気温水器,パブリック向け小型電気温水器,,,小型電気温水器(洗面･手洗用),EHPN-CB12ECV4,,パブリック向け,洗面･手洗用,出湯温度可変タイプ,オートウィークリータイマータイプ,
/KYUUTOU/DENON_P2/,EHPNCA12S3_SA,EHPNCA12S3_SB,EHPNCA12S3_SC,,,,,,小型電気温水器,パブリック向け小型電気温水器,,,小型電気温水器(洗面･手洗用),EHPN-CB12S4,,パブリック向け,洗面･手洗用,適温出湯タイプ,,
/KYUUTOU/DENON_P2/,EHPNCA12V3_SA,EHPNCA12V3_SB,EHPNCA12V3_SC,,,,,,小型電気温水器,パブリック向け小型電気温水器,,,小型電気温水器(洗面･手洗用),EHPN-CB12V4,,パブリック向け,洗面･手洗用,出湯温度可変タイプ,,
/KYUUTOU/DENON_P2/,EHPNCA20ECS2_SA,EHPNCA20ECS2_SB,EHPNCA20ECS2_SC,,,,,,小型電気温水器,パブリック向け小型電気温水器,,,小型電気温水器(洗面･手洗用),EHPN-CB20ECS3,,パブリック向け,洗面･手洗用,適温出湯タイプ,オートウィークリータイマータイプ,
/KYUUTOU/DENON_P2/,EHPNCA20ECV2_SA,EHPNCA20ECV2_SB,EHPNCA20ECV2_SC,,,,,,小型電気温水器,パブリック向け小型電気温水器,,,小型電気温水器(洗面･手洗用),EHPN-CB20ECV3,,パブリック向け,洗面･手洗用,出湯温度可変タイプ,オートウィークリータイマータイプ,
/KYUUTOU/DENON_P2/,EHPNCA25ECV2_SA,EHPNCA25ECV2_SB,EHPNCA25ECV2_SC,,,,,,小型電気温水器,パブリック向け小型電気温水器,,,小型電気温水器(洗面･手洗用),EHPN-CB25ECV3,,パブリック向け,洗面･手洗用,出湯温度可変タイプ,オートウィークリータイマータイプ,
/KYUUTOU/DENON_P2/,EHPNCA25V2_SA,EHPNCA25V2_SB,EHPNCA25V2_SC,,,,,,小型電気温水器,パブリック向け小型電気温水器,,,小型電気温水器(洗面･手洗用),EHPN-CB25V3,,パブリック向け,洗面･手洗用,出湯温度可変タイプ,,
/KYUUTOU/DENON_P2/,EHPNCA8ECS1_SA,EHPNCA8ECS1_SB,EHPNCA8ECS1_SC,,,,,,小型電気温水器,パブリック向け小型電気温水器,,,小型電気温水器(洗面･手洗用),EHPN-CB8ECS2,,パブリック向け,洗面･手洗用,適温出湯タイプ,オートウィークリータイマータイプ,
/KYUUTOU/DENON_P/,EHMNT1SC1_300C_SA,EHMNT1SC1_300C_SB,EHMNT1SC1_300C_SC,,,,,,小型電気温水器,住宅向け小型電気温水器,洗面化粧室（手洗洗面用）,,小型電気温水器(洗面･手洗用),EHMN-T1SC1-300C,,住宅向け,洗面･手洗用,オートマージュA,ポップアップなし,
/KYUUTOU/DENON_J/,EHPNF12N1_SA,EHPNF12N1_SB,EHPNF12N1_SC,,,,,,小型電気温水器,住宅向け小型電気温水器,洗面化粧室（手洗洗面用）,,小型電気温水器(洗面用),EHPN-F12N2,,,,,,
/KYUUTOU/DENON_J/,EHPNF6N4_SA,EHPNF6N4_SB,EHPNF6N4_SC,,,,,,小型電気温水器,住宅向け小型電気温水器,洗面化粧室（手洗洗面用）,,小型電気温水器(洗面用),EHPN-F6N5,,,,,,
/KYUUTOU/DENON_J/,EG1S1_SA,EG1S1_SB,EG1S1_SC,,,,,,小型電気温水器,住宅向け小型電気温水器,洗面化粧室（手洗洗面用）,,即湯システム,EG-1S1-S,,住宅向け,洗面化粧台・カウンター用,給湯配管接続タイプ,,
/KYUUTOU/DENON_J/,EG1S2_SA,EG1S2_SB,EG1S2_SC,,,,,,小型電気温水器,住宅向け小型電気温水器,洗面化粧室（手洗洗面用）,,即湯システム,EG-1S2,,住宅向け,左右配管対応,逃し弁内臓,,
/KYUUTOU/DENON_J/,EG2S3_SA,EG2S3_SB,EG2S3_SC,,,,,,小型電気温水器,住宅向け小型電気温水器,洗面化粧室（手洗洗面用）,,即湯システム,EG-2S3,,住宅向け,減圧弁・逃し弁内臓,,,
/KYUUTOU/DENON_J/,EG2S2_SA,EG2S2_SB,EG2S2_SC,,,,,,小型電気温水器,住宅向け小型電気温水器,洗面化粧室（手洗洗面用）,,即湯システム ほっとエクスプレス,EG-2S2-S,,,,,,
/KYUUTOU/DENON_J/,EHPNF12N1_SA,EHPNF12N1_SB,EHPNF12N1_SC,,,,,,小型電気温水器,住宅向け小型電気温水器,洗面化粧室（洗髪用）・ミニキッチン用,,小型電気温水器(洗髪･ミニキッチン用),EHPN-H12V2,,,,,,
/KYUUTOU/DENON_J/,EHPNH25N3_SA,EHPNH25N3_SB,EHPNH25N3_SC,,,,,,小型電気温水器,住宅向け小型電気温水器,洗面化粧室（洗髪用）・ミニキッチン用,,小型電気温水器(洗髪･ミニキッチン用),EHPN-H25N4,,,,,,
